Error:Execution failed for task 'app:generateDebugBuildConfig'

execution failed for task ':app:checkdebugduplicateclasses
execute task action error android studio
org gradle execution multiplebuildfailures build completed with 1 failures
execution failed for task ':app:processdebugmanifest
gradle build failed
execution failed for task ':app:mergeextdexdebug
execution failed for dexingnoclasspathtransform
gradle build failed android studio

Error:Execution failed for task 'app:generateDebugBuildConfig'

java.io.FileNotFoundException: C:\Users\bok\Desktop\Zipzap\app\build\generated\source\buildConfig\debug\com\storie\myapp \BuildConfig.java (Le chemin d’accès spécifié est introuvable)

What's the solution ..

I hope to find a solution to this problem

Try to clean project this is working for me

for android

$ cd android 

$ ./gradlew clean

BUILD SUCCESSFUL in 5s
1 actionable task: 1 executed

Build Error "Execution failed for task ':app , I had the same problem, I did some changes in build.gradle (Module: app) and it worked for me. I changed this androidTestImplementation� Error:Execution failed for task ':app:prepareDebugAndroidTestDependencies'. Dependency Error. See console for details. After adding the the following dependencies in

Changing port worked for me

You Could try:

react-native run-android --port=8082

Gradle Error | Execution failed for task, This video shows how to solve "Execution failed for task':app:compileDebugAidll'. error Duration: 4:54 Posted: 16 Oct 2017 Error:Execution failed for task ‘:app:preDebugAndroidTestBuild’. Conflict with dependency ‘com.android.support:support-annotations’ in project ‘:app’. Resolved versions for app (26.1.0) and test app

Try to clean and rebuild project or you can try to remove whole build folder and build after removing. If it won't help, show your build.gradle, your current information isn't enough to recognise the reason of problem.

Error:Execution failed for task | Resolved versions for app, Error:Execution failed for task ':app:preDebugAndroidTestBuild'. Conflict with dependency Duration: 0:47 Posted: 20 May 2018 Task :react-native-video:verifyReleaseResources FAILED · Issue , * What went wrong: Execution failed for task ':react-native-video: verifyReleaseResources'. > java.util.concurrent.ExecutionException: com.android Error:Execution failed for task 'app:generateDebugBuildConfig' java.io.FileNotFoundException: C:\Users\bok\Desktop\Zipzap\app\build

React Native

Faced similar issue while building react native app. Running on the different port as the default port (8081) is used by some other app.

Command to build the app.

react-native run-android --port=8082

Solution

Removed extra attribute android:screenOrientation="portrait". If you check the log, it says

lineNumber: 26; columnNumber: 56; Attribute "screenOrientation" bound to namespace "http://schemas.android.com/apk/res/android" was already specified for element "activity".

hence removed the same attribute. This was being added multiple times

Error log

Configure project :react-native-webview
:react-native-webview:reactNativeAndroidRoot /Users/PROJECT_PATH/node_modules/react-native/android

Task :app:generateDebugBuildConfig FAILED

FAILURE: Build failed with an exception.

* What went wrong:
Execution failed for task ':app:generateDebugBuildConfig'.
org.xml.sax.SAXParseException; systemId: file:/Users/PROJECT_PATH/android/app/src/main/AndroidManifest.xml; lineNumber: 26; columnNumber: 56; Attribute "screenOrientation" bound to namespace "http://schemas.android.com/apk/res/android" was already specified for element "activity".

* Try:
Run with --stacktrace option to get the stack trace. Run with --info or --debug option to get more log output. Run with --scan to get full insights.

* Get more help at https://help.gradle.org

BUILD FAILED in 1s
32 actionable tasks: 1 executed, 31 up-to-date
Could not install the app on the device, read the error above for details.
Make sure you have an Android emulator running or a device connected and have
set up your Android development environment:
https://facebook.github.io/react-native/docs/getting-started.html

Command failed: ./gradlew installDebug

Compilation Error Execution failed for task ':app , When trying to make a beta version on Crashlytics using Fastlane Command executed fastlane beta Complete output when running fastlane,� This problem has recently been encountered in a new projec Error:Execution failed for task ':app:clean'. Unable to delete directory:** My studio is 2.3.3 I had similar problems before, and the solution was to add below content to the app:b

Error:Execution failed for task ':ArJpctBaseLib , Just downloaded source and imported the library, getting this errror when trying to build the project Error:Execution failed for task� Error: Execution failed for task ':app:clean'. Unable to delete file. Ask Question Asked 4 years, 10 months ago. Active 2 months ago. Viewed 190k times

I am getting error — Execution failed for task ':app:kaptDebugKotlin , I am getting error — Execution failed for task ':app:kaptDebugKotlin'.” is published by Akshay Nandwana. If someone had a successful solution, which clearly worked for more than one person in this specific case, then it is a legitimate answer. In short, your posting history should not be predominantly self-promotional and your resource should be high-quality and complete. Error:Execution failed for task ':app:mergeDebugResources'.

Error:Execution failed for task ':app:preDebugAndroidTestBuild , Error:Execution failed for task ':app:preDebugAndroidTestBuild' conflict with dependency: Android Studio. The reason behind this issue is a mismatch in� I came across this error in Android, when I create a project with minSDK 21 and target/compile SDK 26: Error:Execution failed for task ':app:preDebugAndroidT