Hot questions for Using Glide in android studio

Top 10 Java Open Source / Glide / android studio

Question:

I am running Android Studio 3.0. I am currently trying to make Glide version 4.3.0 work, but had the same issues with version 4.2.0.

My project runs fine without adding the Glide package dependencies in my build.gradle file, downloaded from here https://github.com/bumptech/glide. I also followed the setup instructions here too. First I added the jar file to my libs folder, and then added the dependencies.

The full error is

Error:Execution failed for task 
':app:transformDexArchiveWithExternalLibsDexMergerForDebug'.
> com.android.builder.dexing.DexArchiveMergerException: Unable to merge dex

I've researched this issue a lot but only found solutions for other packages which provided specific fixes for those packages, but I wasn't able to find a solution for this specific package.

Here's the full gradle stack trace.

* Exception is:
org.gradle.api.tasks.TaskExecutionException: Execution failed for task ':app:transformClassesWithMultidexlistForDebug'.
    at org.gradle.api.internal.tasks.execution.ExecuteActionsTaskExecuter.executeActions(ExecuteActionsTaskExecuter.java:100)
    at org.gradle.api.internal.tasks.execution.ExecuteActionsTaskExecuter.execute(ExecuteActionsTaskExecuter.java:70)
    at org.gradle.api.internal.tasks.execution.SkipUpToDateTaskExecuter.execute(SkipUpToDateTaskExecuter.java:63)
    at org.gradle.api.internal.tasks.execution.ResolveTaskOutputCachingStateExecuter.execute(ResolveTaskOutputCachingStateExecuter.java:54)
    at org.gradle.api.internal.tasks.execution.ValidatingTaskExecuter.execute(ValidatingTaskExecuter.java:58)
    at org.gradle.api.internal.tasks.execution.SkipEmptySourceFilesTaskExecuter.execute(SkipEmptySourceFilesTaskExecuter.java:88)
    at org.gradle.api.internal.tasks.execution.ResolveTaskArtifactStateTaskExecuter.execute(ResolveTaskArtifactStateTaskExecuter.java:52)
    at org.gradle.api.internal.tasks.execution.SkipTaskWithNoActionsExecuter.execute(SkipTaskWithNoActionsExecuter.java:52)
    at org.gradle.api.internal.tasks.execution.SkipOnlyIfTaskExecuter.execute(SkipOnlyIfTaskExecuter.java:54)
    at org.gradle.api.internal.tasks.execution.ExecuteAtMostOnceTaskExecuter.execute(ExecuteAtMostOnceTaskExecuter.java:43)
    at org.gradle.api.internal.tasks.execution.CatchExceptionTaskExecuter.execute(CatchExceptionTaskExecuter.java:34)
    at org.gradle.execution.taskgraph.DefaultTaskGraphExecuter$EventFiringTaskWorker$1.run(DefaultTaskGraphExecuter.java:248)
    at org.gradle.internal.progress.DefaultBuildOperationExecutor$RunnableBuildOperationWorker.execute(DefaultBuildOperationExecutor.java:336)
    at org.gradle.internal.progress.DefaultBuildOperationExecutor$RunnableBuildOperationWorker.execute(DefaultBuildOperationExecutor.java:328)
    at org.gradle.internal.progress.DefaultBuildOperationExecutor.execute(DefaultBuildOperationExecutor.java:197)
    at org.gradle.internal.progress.DefaultBuildOperationExecutor.run(DefaultBuildOperationExecutor.java:107)
    at org.gradle.execution.taskgraph.DefaultTaskGraphExecuter$EventFiringTaskWorker.execute(DefaultTaskGraphExecuter.java:241)
    at org.gradle.execution.taskgraph.DefaultTaskGraphExecuter$EventFiringTaskWorker.execute(DefaultTaskGraphExecuter.java:230)
    at org.gradle.execution.taskgraph.DefaultTaskPlanExecutor$TaskExecutorWorker.processTask(DefaultTaskPlanExecutor.java:124)
    at org.gradle.execution.taskgraph.DefaultTaskPlanExecutor$TaskExecutorWorker.access$200(DefaultTaskPlanExecutor.java:80)
    at org.gradle.execution.taskgraph.DefaultTaskPlanExecutor$TaskExecutorWorker$1.execute(DefaultTaskPlanExecutor.java:105)
    at org.gradle.execution.taskgraph.DefaultTaskPlanExecutor$TaskExecutorWorker$1.execute(DefaultTaskPlanExecutor.java:99)
    at org.gradle.execution.taskgraph.DefaultTaskExecutionPlan.execute(DefaultTaskExecutionPlan.java:625)
    at org.gradle.execution.taskgraph.DefaultTaskExecutionPlan.executeWithTask(DefaultTaskExecutionPlan.java:580)
    at org.gradle.execution.taskgraph.DefaultTaskPlanExecutor$TaskExecutorWorker.run(DefaultTaskPlanExecutor.java:99)
    at org.gradle.internal.concurrent.ExecutorPolicy$CatchAndRecordFailures.onExecute(ExecutorPolicy.java:63)
    at org.gradle.internal.concurrent.ManagedExecutorImpl$1.run(ManagedExecutorImpl.java:46)
    at org.gradle.internal.concurrent.ThreadFactoryImpl$ManagedThreadRunnable.run(ThreadFactoryImpl.java:55)
Caused by: java.lang.RuntimeException: java.io.IOException: Can't write [C:\Users\Alex\AndroidStudioProjects\ChanReader\app\build\intermediates\multi-dex\debug\componentClasses.jar] (Can't read [C:\Users\Alex\.gradle\caches\modules-2\files-2.1\com.github.bumptech.glide\glide\4.3.0\5ef2a3700ab3320576eab21ff504189e5a92a350\glide-4.3.0.jar(;;;;;;**.class)] (Duplicate zip entry [glide-4.3.0.jar:com/bumptech/glide/util/Synthetic.class]))
    at com.android.builder.profile.Recorder$Block.handleException(Recorder.java:55)
    at com.android.builder.profile.ThreadRecorder.record(ThreadRecorder.java:104)
    at com.android.build.gradle.internal.pipeline.TransformTask.transform(TransformTask.java:213)
    at org.gradle.internal.reflect.JavaMethod.invoke(JavaMethod.java:73)
    at org.gradle.api.internal.project.taskfactory.DefaultTaskClassInfoStore$IncrementalTaskAction.doExecute(DefaultTaskClassInfoStore.java:173)
    at org.gradle.api.internal.project.taskfactory.DefaultTaskClassInfoStore$StandardTaskAction.execute(DefaultTaskClassInfoStore.java:134)
    at org.gradle.api.internal.project.taskfactory.DefaultTaskClassInfoStore$StandardTaskAction.execute(DefaultTaskClassInfoStore.java:121)
    at org.gradle.api.internal.tasks.execution.ExecuteActionsTaskExecuter$1.run(ExecuteActionsTaskExecuter.java:122)
    at org.gradle.internal.progress.DefaultBuildOperationExecutor$RunnableBuildOperationWorker.execute(DefaultBuildOperationExecutor.java:336)
    at org.gradle.internal.progress.DefaultBuildOperationExecutor$RunnableBuildOperationWorker.execute(DefaultBuildOperationExecutor.java:328)
    at org.gradle.internal.progress.DefaultBuildOperationExecutor.execute(DefaultBuildOperationExecutor.java:197)
    at org.gradle.internal.progress.DefaultBuildOperationExecutor.run(DefaultBuildOperationExecutor.java:107)
    at org.gradle.api.internal.tasks.execution.ExecuteActionsTaskExecuter.executeAction(ExecuteActionsTaskExecuter.java:111)
    at org.gradle.api.internal.tasks.execution.ExecuteActionsTaskExecuter.executeActions(ExecuteActionsTaskExecuter.java:92)
    ... 27 more
Caused by: java.io.IOException: Can't write [C:\Users\Alex\AndroidStudioProjects\ChanReader\app\build\intermediates\multi-dex\debug\componentClasses.jar] (Can't read [C:\Users\Alex\.gradle\caches\modules-2\files-2.1\com.github.bumptech.glide\glide\4.3.0\5ef2a3700ab3320576eab21ff504189e5a92a350\glide-4.3.0.jar(;;;;;;**.class)] (Duplicate zip entry [glide-4.3.0.jar:com/bumptech/glide/util/Synthetic.class]))
    at proguard.OutputWriter.writeOutput(OutputWriter.java:187)
    at proguard.OutputWriter.execute(OutputWriter.java:79)
    at proguard.ProGuard.writeOutput(ProGuard.java:427)
    at proguard.ProGuard.execute(ProGuard.java:175)
    at com.android.build.gradle.internal.transforms.BaseProguardAction.runProguard(BaseProguardAction.java:61)
    at com.android.build.gradle.internal.transforms.MainDexListTransform.shrinkWithProguard(MainDexListTransform.java:232)
    at com.android.build.gradle.internal.transforms.MainDexListTransform.transform(MainDexListTransform.java:184)
    at com.android.build.gradle.internal.pipeline.TransformTask$2.call(TransformTask.java:222)
    at com.android.build.gradle.internal.pipeline.TransformTask$2.call(TransformTask.java:218)
    at com.android.builder.profile.ThreadRecorder.record(ThreadRecorder.java:102)
    ... 39 more
Caused by: java.io.IOException: Can't read [C:\Users\Alex\.gradle\caches\modules-2\files-2.1\com.github.bumptech.glide\glide\4.3.0\5ef2a3700ab3320576eab21ff504189e5a92a350\glide-4.3.0.jar(;;;;;;**.class)] (Duplicate zip entry [glide-4.3.0.jar:com/bumptech/glide/util/Synthetic.class])
    at proguard.InputReader.readInput(InputReader.java:188)
    at proguard.InputReader.readInput(InputReader.java:158)
    at proguard.OutputWriter.writeOutput(OutputWriter.java:176)
    ... 48 more
Caused by: java.io.IOException: Duplicate zip entry [glide-4.3.0.jar:com/bumptech/glide/util/Synthetic.class]
    at proguard.io.JarWriter.getOutputStream(JarWriter.java:138)
    at proguard.io.FilteredDataEntryWriter.getOutputStream(FilteredDataEntryWriter.java:106)
    at proguard.io.FilteredDataEntryWriter.getOutputStream(FilteredDataEntryWriter.java:106)
    at proguard.io.FilteredDataEntryWriter.getOutputStream(FilteredDataEntryWriter.java:92)
    at proguard.io.ClassRewriter.read(ClassRewriter.java:68)
    at proguard.io.FilteredDataEntryReader.read(FilteredDataEntryReader.java:87)
    at proguard.io.FilteredDataEntryReader.read(FilteredDataEntryReader.java:87)
    at proguard.io.FilteredDataEntryReader.read(FilteredDataEntryReader.java:87)
    at proguard.io.JarReader.read(JarReader.java:65)
    at proguard.io.DirectoryPump.readFiles(DirectoryPump.java:65)
    at proguard.io.DirectoryPump.pumpDataEntries(DirectoryPump.java:53)
    at proguard.InputReader.readInput(InputReader.java:184)
    ... 50 more

Answer:

The issue was adding the jar file to the libs folder of my project. Apparently, this created a duplication issue. After removing it, my application runs fine.

I naively did this because I used the Picasso library first in which I did this. I assumed it was standard practice.

Question:

I am using Glide version = 4.7.1

I have no idea how to authenticate an image by glide. This code is what I did.

I created:

 private static final String AUTHORIZATION = "ss-id=doa3cx8OV3aGLThRrpnh;";
private static final String ABC = "application/json";

public static GlideUrl getUrlWithHeaders(String url){
    return new GlideUrl(url, new LazyHeaders.Builder()
            .addHeader("Cookie", AUTHORIZATION)
            .addHeader("Accept", ABC)
            .build());
}

}

String s = "http://192.168.1.144/api/download/" + mImageIds.get(position);
        GlideApp
                .with(mContext)
                .load(Headers.getUrlWithHeaders(s))
                .centerCrop()
                .transition(DrawableTransitionOptions.withCrossFade())
                .into((imageView));

Any helps,


Answer:

This is working code for Glide v3/v4:

String url = "http://192.168.1.144/api/download/" + mImageIds.get(position);

GlideUrl glideUrl = new GlideUrl(url, 
    new LazyHeaders.Builder()
            .addHeader("Cookie", AUTHORIZATION)
            .addHeader("Accept", ABC)
            .build());

Glide.with(this)
    .load(glideUrl)
    .into(imageView);

Question:

Big problem since upgrading to Android Studio 3.1, I get:

No cached version of com.github.bumptech.glide:compiler:4.6.1 available for offline mode

But I am not in offline mode as you can see here:

I tried Clean Project and Rebuild Project, all with no success. I even rebooted my PC.

Here's my Build.gradle:

dependencies {
    implementation fileTree(include: ['*.jar'], dir: 'libs')
    implementation 'com.android.support:design:27.1.0'
    implementation 'com.android.support:support-v4:27.1.0'
    implementation 'com.android.support:appcompat-v7:27.1.0'
    implementation "com.android.support:gridlayout-v7:27.1.0"
    implementation 'com.android.support:exifinterface:27.1.0'
    implementation 'com.android.support.constraint:constraint-layout:1.0.2'
    implementation 'com.google.code.gson:gson:2.8.2'
    testImplementation 'junit:junit:4.12'
    androidTestImplementation 'com.android.support.test:runner:1.0.1'
    androidTestImplementation 'com.android.support.test.espresso:espresso-core:3.0.1'
    implementation 'com.github.bumptech.glide:glide:4.6.1'
    annotationProcessor 'com.github.bumptech.glide:compiler:4.6.1'
}

Answer:

I ran into this issue and "offline work" was unchecked inside gradle settings. After wasting 2 hours on it, I realized that I had --offline in the Command-line options of Build, Execution, Deployment > Compiler. So make sure you don't have that command listed there when you encounter this issue.

Question:

Since upgrading to Android Studio 3.0, I've had trouble getting 'AppGlideModule' to be recognized. Android Studio doesn't recognize the import

import com.bumptech.glide.module.AppGlideModule;

see here

I have tried updating 'compile' to 'implementation'. I have also tried cleaning and rebuilding the projects, as well as invalidating caches/restarting.

build.gradle (module:app)

apply plugin: 'com.android.application'

android {
    compileSdkVersion 26
    defaultConfig {
        applicationId "com.example.test"
        minSdkVersion 15
        targetSdkVersion 26
        buildToolsVersion "26.0.2"
        versionCode 1
        versionName "1.0"
        testInstrumentationRunner "android.support.test.runner.AndroidJUnitRunner"
    }
    buildTypes {
        release {
            minifyEnabled false
            proguardFiles getDefaultProguardFile('proguard-android.txt'), 'proguard-rules.pro'
        }
    }
}

dependencies {
    implementation fileTree(dir: 'libs', include: ['*.jar'])
    implementation 'com.android.support:appcompat-v7:26.1.0'
    implementation 'com.android.support:recyclerview-v7:26.1.0'
    implementation 'com.android.support:design:26.1.0'
    implementation 'com.android.support.constraint:constraint-layout:1.0.2'
    testImplementation 'junit:junit:4.12'
    androidTestImplementation 'com.android.support.test:runner:1.0.1'
    androidTestImplementation 'com.android.support.test.espresso:espresso-core:3.0.1'

    implementation 'com.squareup.okhttp3:okhttp:3.9.0'
    implementation 'com.github.bumptech.glide:annotations:4.2.0'
    annotationProcessor 'com.github.bumptech.glide:compiler:4.2.0'
}

I feel like 'com.github.bumptech.glide:compiler:4.2.0' isn't being recognized and that's why 'GlideAppModule' is throwing an error but I can't figure out why.

EDIT: 'com.github.bumptech.glide:comiler:4.2.0' is the cause of the error. This was working before updating to Android Studio 3.0

stacktrace

Executing tasks: [clean, :app:assembleDebug]

Configuration on demand is an incubating feature.
:clean
:app:clean
:app:preBuild UP-TO-DATE
:app:preDebugBuild
:app:compileDebugAidl
:app:compileDebugRenderscript
:app:checkDebugManifest
:app:generateDebugBuildConfig
:app:prepareLintJar UP-TO-DATE
:app:generateDebugResValues
:app:generateDebugResources
:app:mergeDebugResources
:app:createDebugCompatibleScreenManifests
:app:processDebugManifest
:app:splitsDiscoveryTaskDebug
:app:processDebugResources
:app:generateDebugSources
:app:javaPreCompileDebug
:app:compileDebugJavaWithJavac
C:\Users\user\Documents\test\app\src\main\java\com\example\test\MyAppGlideModule.java:4: error: package com.bumptech.glide.module does not exist
import com.bumptech.glide.module.AppGlideModule;
                                ^
C:\Users\user\Documents\test\app\src\main\java\com\example\test\MyAppGlideModule.java:7: error: cannot find symbol
public final class MyAppGlideModule extends AppGlideModule {}
                                            ^
  symbol: class AppGlideModule

 FAILED

FAILURE: Build failed with an exception.

* What went wrong:
Execution failed for task ':app:compileDebugJavaWithJavac'.
> java.lang.NullPointerException: element == null

* Try:
Run with --info or --debug option to get more log output.

* Exception is:
org.gradle.api.tasks.TaskExecutionException: Execution failed for task ':app:compileDebugJavaWithJavac'.
    at org.gradle.api.internal.tasks.execution.ExecuteActionsTaskExecuter.executeActions(ExecuteActionsTaskExecuter.java:100)
    at org.gradle.api.internal.tasks.execution.ExecuteActionsTaskExecuter.execute(ExecuteActionsTaskExecuter.java:70)
    at org.gradle.api.internal.tasks.execution.SkipUpToDateTaskExecuter.execute(SkipUpToDateTaskExecuter.java:63)
    at org.gradle.api.internal.tasks.execution.ResolveTaskOutputCachingStateExecuter.execute(ResolveTaskOutputCachingStateExecuter.java:54)
    at org.gradle.api.internal.tasks.execution.ValidatingTaskExecuter.execute(ValidatingTaskExecuter.java:58)
    at org.gradle.api.internal.tasks.execution.SkipEmptySourceFilesTaskExecuter.execute(SkipEmptySourceFilesTaskExecuter.java:88)
    at org.gradle.api.internal.tasks.execution.ResolveTaskArtifactStateTaskExecuter.execute(ResolveTaskArtifactStateTaskExecuter.java:52)
    at org.gradle.api.internal.tasks.execution.SkipTaskWithNoActionsExecuter.execute(SkipTaskWithNoActionsExecuter.java:52)
    at org.gradle.api.internal.tasks.execution.SkipOnlyIfTaskExecuter.execute(SkipOnlyIfTaskExecuter.java:54)
    at org.gradle.api.internal.tasks.execution.ExecuteAtMostOnceTaskExecuter.execute(ExecuteAtMostOnceTaskExecuter.java:43)
    at org.gradle.api.internal.tasks.execution.CatchExceptionTaskExecuter.execute(CatchExceptionTaskExecuter.java:34)
    at org.gradle.execution.taskgraph.DefaultTaskGraphExecuter$EventFiringTaskWorker$1.run(DefaultTaskGraphExecuter.java:248)
    at org.gradle.internal.progress.DefaultBuildOperationExecutor$RunnableBuildOperationWorker.execute(DefaultBuildOperationExecutor.java:336)
    at org.gradle.internal.progress.DefaultBuildOperationExecutor$RunnableBuildOperationWorker.execute(DefaultBuildOperationExecutor.java:328)
    at org.gradle.internal.progress.DefaultBuildOperationExecutor.execute(DefaultBuildOperationExecutor.java:197)
    at org.gradle.internal.progress.DefaultBuildOperationExecutor.run(DefaultBuildOperationExecutor.java:107)
    at org.gradle.execution.taskgraph.DefaultTaskGraphExecuter$EventFiringTaskWorker.execute(DefaultTaskGraphExecuter.java:241)
    at org.gradle.execution.taskgraph.DefaultTaskGraphExecuter$EventFiringTaskWorker.execute(DefaultTaskGraphExecuter.java:230)
    at org.gradle.execution.taskgraph.DefaultTaskPlanExecutor$TaskExecutorWorker.processTask(DefaultTaskPlanExecutor.java:124)
    at org.gradle.execution.taskgraph.DefaultTaskPlanExecutor$TaskExecutorWorker.access$200(DefaultTaskPlanExecutor.java:80)
    at org.gradle.execution.taskgraph.DefaultTaskPlanExecutor$TaskExecutorWorker$1.execute(DefaultTaskPlanExecutor.java:105)
    at org.gradle.execution.taskgraph.DefaultTaskPlanExecutor$TaskExecutorWorker$1.execute(DefaultTaskPlanExecutor.java:99)
    at org.gradle.execution.taskgraph.DefaultTaskExecutionPlan.execute(DefaultTaskExecutionPlan.java:625)
    at org.gradle.execution.taskgraph.DefaultTaskExecutionPlan.executeWithTask(DefaultTaskExecutionPlan.java:580)
    at org.gradle.execution.taskgraph.DefaultTaskPlanExecutor$TaskExecutorWorker.run(DefaultTaskPlanExecutor.java:99)
    at org.gradle.internal.concurrent.ExecutorPolicy$CatchAndRecordFailures.onExecute(ExecutorPolicy.java:63)
    at org.gradle.internal.concurrent.ManagedExecutorImpl$1.run(ManagedExecutorImpl.java:46)
    at org.gradle.internal.concurrent.ThreadFactoryImpl$ManagedThreadRunnable.run(ThreadFactoryImpl.java:55)
Caused by: java.lang.RuntimeException: java.lang.NullPointerException: element == null
    at com.sun.tools.javac.main.Main.compile(Main.java:553)
    at com.sun.tools.javac.api.JavacTaskImpl.doCall(JavacTaskImpl.java:129)
    at com.sun.tools.javac.api.JavacTaskImpl.call(JavacTaskImpl.java:138)
    at org.gradle.api.internal.tasks.compile.JdkJavaCompiler.execute(JdkJavaCompiler.java:49)
    at org.gradle.api.internal.tasks.compile.JdkJavaCompiler.execute(JdkJavaCompiler.java:36)
    at org.gradle.api.internal.tasks.compile.NormalizingJavaCompiler.delegateAndHandleErrors(NormalizingJavaCompiler.java:99)
    at org.gradle.api.internal.tasks.compile.NormalizingJavaCompiler.execute(NormalizingJavaCompiler.java:52)
    at org.gradle.api.internal.tasks.compile.NormalizingJavaCompiler.execute(NormalizingJavaCompiler.java:37)
    at org.gradle.api.internal.tasks.compile.CleaningJavaCompilerSupport.execute(CleaningJavaCompilerSupport.java:35)
    at org.gradle.api.internal.tasks.compile.CleaningJavaCompilerSupport.execute(CleaningJavaCompilerSupport.java:25)
    at org.gradle.api.internal.tasks.compile.incremental.IncrementalCompilationFinalizer.execute(IncrementalCompilationFinalizer.java:39)
    at org.gradle.api.internal.tasks.compile.incremental.IncrementalCompilationFinalizer.execute(IncrementalCompilationFinalizer.java:24)
    at org.gradle.api.tasks.compile.JavaCompile.performCompilation(JavaCompile.java:198)
    at org.gradle.api.tasks.compile.JavaCompile.compile(JavaCompile.java:129)
    at com.android.build.gradle.tasks.factory.AndroidJavaCompile.compile(AndroidJavaCompile.java:95)
    at org.gradle.internal.reflect.JavaMethod.invoke(JavaMethod.java:73)
    at org.gradle.api.internal.project.taskfactory.DefaultTaskClassInfoStore$IncrementalTaskAction.doExecute(DefaultTaskClassInfoStore.java:173)
    at org.gradle.api.internal.project.taskfactory.DefaultTaskClassInfoStore$StandardTaskAction.execute(DefaultTaskClassInfoStore.java:134)
    at org.gradle.api.internal.project.taskfactory.DefaultTaskClassInfoStore$StandardTaskAction.execute(DefaultTaskClassInfoStore.java:121)
    at org.gradle.api.internal.tasks.execution.ExecuteActionsTaskExecuter$1.run(ExecuteActionsTaskExecuter.java:122)
    at org.gradle.internal.progress.DefaultBuildOperationExecutor$RunnableBuildOperationWorker.execute(DefaultBuildOperationExecutor.java:336)
    at org.gradle.internal.progress.DefaultBuildOperationExecutor$RunnableBuildOperationWorker.execute(DefaultBuildOperationExecutor.java:328)
    at org.gradle.internal.progress.DefaultBuildOperationExecutor.execute(DefaultBuildOperationExecutor.java:197)
    at org.gradle.internal.progress.DefaultBuildOperationExecutor.run(DefaultBuildOperationExecutor.java:107)
    at org.gradle.api.internal.tasks.execution.ExecuteActionsTaskExecuter.executeAction(ExecuteActionsTaskExecuter.java:111)
    at org.gradle.api.internal.tasks.execution.ExecuteActionsTaskExecuter.executeActions(ExecuteActionsTaskExecuter.java:92)
    ... 27 more
Caused by: java.lang.NullPointerException: element == null
    at com.bumptech.glide.repackaged.com.squareup.javapoet.Util.checkNotNull(Util.java:68)
    at com.bumptech.glide.repackaged.com.squareup.javapoet.ClassName.get(ClassName.java:209)
    at com.bumptech.glide.annotation.compiler.RequestManagerGenerator.<init>(RequestManagerGenerator.java:83)
    at com.bumptech.glide.annotation.compiler.AppModuleProcessor.<init>(AppModuleProcessor.java:42)
    at com.bumptech.glide.annotation.compiler.GlideAnnotationProcessor.init(GlideAnnotationProcessor.java:81)
    at com.sun.tools.javac.processing.JavacProcessingEnvironment$ProcessorState.<init>(JavacProcessingEnvironment.java:500)
    at com.sun.tools.javac.processing.JavacProcessingEnvironment$DiscoveredProcessors$ProcessorStateIterator.next(JavacProcessingEnvironment.java:597)
    at com.sun.tools.javac.processing.JavacProcessingEnvironment.discoverAndRunProcs(JavacProcessingEnvironment.java:690)
    at com.sun.tools.javac.processing.JavacProcessingEnvironment.access$1800(JavacProcessingEnvironment.java:91)
    at com.sun.tools.javac.processing.JavacProcessingEnvironment$Round.run(JavacProcessingEnvironment.java:1035)
    at com.sun.tools.javac.processing.JavacProcessingEnvironment.doProcessing(JavacProcessingEnvironment.java:1176)
    at com.sun.tools.javac.main.JavaCompiler.processAnnotations(JavaCompiler.java:1170)
    at com.sun.tools.javac.main.JavaCompiler.compile(JavaCompiler.java:856)
    at com.sun.tools.javac.main.Main.compile(Main.java:523)
    ... 52 more


* Get more help at https://help.gradle.org

BUILD FAILED in 8s

16 actionable tasks: 15 executed, 1 up-to-date

Answer:

Changing

implementation 'com.github.bumptech.glide:annotations:4.2.0'
annotationProcessor 'com.github.bumptech.glide:compiler:4.2.0'

to

implementation 'com.github.bumptech.glide:glide:4.2.0'
annotationProcessor 'com.github.bumptech.glide:compiler:4.2.0'

has solved my issue. I don't know how I ended up with a different implementation but there it is.

Question:

when I want to add this library:

implementation 'com.github.bumptech.glide:glide:4.9.0'

My android take this error:

Unable to resolve dependency for ':app@debug/compileClasspath': Could not resolve com.github.bumptech.glide:glide:4.9.0.

and this is my app module

apply plugin: 'com.android.application'
android {
compileSdkVersion 27
defaultConfig {
    applicationId "com.example.mahdi.chatapp"
    minSdkVersion 16
    targetSdkVersion 27
    versionCode 1
    versionName "1.0"
    testInstrumentationRunner "android.support.test.runner.AndroidJUnitRunner"
}
buildTypes {
    release {
        minifyEnabled false
        proguardFiles getDefaultProguardFile('proguard-android.txt'), 'proguard-rules.pro'
    }
}
}

dependencies {
    implementation fileTree(include: ['*.jar'], dir: 'libs')
    implementation 'com.android.support:appcompat-v7:27.1.1'
    implementation 'com.android.support.constraint:constraint-layout:1.1.3'
    implementation 'com.google.firebase:firebase-auth:16.1.0'
    implementation 'com.google.firebase:firebase-config:16.3.0'
    testImplementation 'junit:junit:4.12'
    androidTestImplementation 'com.android.support.test:runner:1.0.2'
    androidTestImplementation 'com.android.support.test.espresso:espresso-core:3.0.2'
    implementation 'com.android.support:support-v4:27.1.1'
    implementation 'com.android.support:design:27.1.1'
    implementation 'com.google.firebase:firebase-core:16.0.7'
    implementation 'com.google.firebase:firebase-database:16.0.6'
    implementation 'com.android.support:cardview-v7:27.1.1'
    implementation 'com.rengwuxian.materialedittext:library:2.1.4'
    implementation 'de.hdodenhof:circleimageview:3.0.0'
    implementation 'com.github.bumptech.glide:glide:4.9.0'
}

apply plugin: 'com.google.gms.google-services'

Answer:

Have you added this code in Gradle file

repositories {
  mavenCentral()
  google()
}

Question:

I have image name (String) which was base64 decoded. But when i want to set that image into circleImageView (library) using Glide, some random data is being printed in LOG and says (file name too long).

My question is - How can we set too long file name images using Glide (OR) do we have any alternative library to load these type of images?

Thanks in advance.


Answer:

Use the following code

Glide.with(context)
    .load(Base64.decode(base64String, Base64.DEFAULT))
    .asBitmap()
    .into(circleImageView);

Question:

i have external local database and i have to save image into database, image come from camera and gallery and image drawable glide load image from imagedrawble but cant load image from camera or gallery and i save uri these images

glide can load this uri from image drawable

  content://media/external/images/media/772718

but cant load this uri from camera or gallery

content://com.android.providers.media.documents/document/image%3A772711

i load image this way

  Uri uri = Uri.parse(modelInsertInfo.getImage_src());

    Log.d("LOG30",uri.toString());
    Glide.with(this).load(uri).into(imgDetail);

Answer:

You can try obtaining path from your uri object and pass it to Glide, check the code below :

Glide.with(this).load(uri.getPath()).into(imgDetail); // get path from Uri and pass it to glide.