Spring Roo project. Project build error: Failed to execute goal

I create a project based on the code from the site

roo> project setup --topLevelPackage com.foo
roo> jpa setup --provider HIBERNATE --database HYPERSONIC_IN_MEMORY
roo> entity jpa --class ~.domain.Timer
roo> field string --fieldName message --notNull
roo> repository jpa --all
roo> service --all
roo> web mvc setup
roo> web mvc view setup --type THYMELEAF
roo> web mvc controller --all --responseType THYMELEAF
roo> web mvc controller --all --pathPrefix /api
roo> quit
mvn spring-boot:run

The building of the project is completed with the following error

[INFO] ------------------------------------------------------------------------
[INFO] BUILD FAILURE
[INFO] ------------------------------------------------------------------------
[INFO] Total time: 12.054 s
[INFO] Finished at: 2018-09-20T19:45:28+03:00
[INFO] ------------------------------------------------------------------------
[ERROR] Failed to execute goal com.mysema.maven:apt-maven-plugin:1.1.3:process
default) on project hello: You need to run build with JDK or have tools.jar on
he classpath.If this occures during eclipse build make sure you run eclipse und
r JDK as well -> [Help 1]
[ERROR]
[ERROR] To see the full stack trace of the errors, re-run Maven with the -e swi
ch.
[ERROR] Re-run Maven using the -X switch to enable full debug logging.
[ERROR]

POM.xml can be found here. Spring roo-2.0.0.RELEASE The error is also displayed in the pom.xml file (the line 592):

You need to run build with JDK or have tools.jar on the classpath.
If this occures during eclipse build make sure you run eclipse under
 JDK as well (com.mysema.maven:apt-maven-plugin:1.1.3:process:default:generate-sources)

In elcipse configuration - c:\Program Files\Java\jdk1.8.0_181. When I run the project from the command line mvn spring-boot:run, I get the same result


java, I create a project based on the code from the site roo> project setup --​topLevelPackage com.foo roo> jpa setup --provider HIBERNATE  Today I ran into an error while trying to create a plain new Spring Roo project based on the latest nightly snapshot build of Roo. [ERROR] Failed to execute goal on


You have to install JDK if you already have JDK, check your elcipse configuration on window>preferences>java>Installed JREs and point your JDK path like this C:\Program Files\Java\jdk1.8.0_112

Spring Roo project. Project build error: Failed to execute goal, Project build error: Failed to execute goal THYMELEAF roo> web mvc controller --all --pathPrefix /api roo> quit mvn spring-boot:run. If I run the following script: GWT script project --topLevelPackage t.com --projectName t --java 7 --packaging JAR jpa setup --database DERBY_EMBEDDED --provider HIBERNATE entity jpa --class ~.domain.Person --testAutomatically field string --fieldName name field number --type java.lang. Float --fieldName price web gwt setup web gwt all


in the file Sts.ini you need to add to the beginning

-vm
c:/Program Files/Java/jdk1.8.0_181/bin/javaw.exe

In the file pom.xml replace <aspectj.plugin.version>1.8</aspectj.plugin.version> on <aspectj.plugin.version>1.9</aspectj.plugin.version>

Failed to execute goal com.querydsl:querydsl-maven-plugin:4.1.4 , spring-projects deleted a comment from hongli8881 on Dec 4, 2018. @​wilkinsona Hi, When I try Spring Roo project Nothwind, I got this errors. When I try to make maven build of repository module I got the error message. But a new error: ``` [INFO] BUILD FAILURE [INFO]-----[INFO] Total time: 56.507 s [INFO] Finished at: 2016-12-23T09:14:03+00:00 [INFO] Final Memory: 29M/78M [INFO]-----[ERROR] Failed to execute goal org.springframework.boot:spring-boot-maven-plugin:1.4.3.RELEASE:run (default-cli) on project petclinic: Unable to find a suitable main class, please


namseoppark/spring-roo-addon-portletmvc, get the following compilation error: [ERROR] Failed to execute goal to host and review code, manage projects, and build software together. Projects. Issues. Give feedback to Atlassian About Jira; Jira Credits; Log In. Acknowledged notifications; Spring Roo; roo 1.2snapshot


[#ROO-3864] Maven-error No plugin found for prefix 'spring-boot', Project: Spring Roo. Component/s: BUILD [ERROR] Failed to execute goal org.​springframework.boot:spring-boot-maven-plugin:1.4.3. The Spring Roo project uses and depends on a lot of Spring related projects, as well as other ones. We would like to thank all those projects and the people working on them, not only for the effort made to provide such excellent libraries and utilities, but also for the guidance and examples given on how to manage an open source Java project.


How to fix MojoFailureException while using spring roo to build web , How to fix MojoFailureException while using spring roo to build web project - eclipse. [ERROR] Re-run Maven using the -X switch to enable full debug logging. [ERROR] [ERROR] For LifecycleExecutionException: Failed to execute goal  I've created the following roo project within datanucleus // Spring Roo 1.2.1.RELEASE [rev 6eae723] log opened at 2012-03-21 22:27:38 project com.dn --java 6 //persistence setup --provider HIBERNATE --database HYPERSONIC_IN_MEMORY persistence setup --provider DATANUCLEUS --database HYPERSONIC_IN_MEMORY entity jpa --class ~.shared.domain.Contact field string --fieldName fullName --notNull field