No Such Module 'FBSDKLoginKit' Xcode 9

no such module swift cocoapods
xcodebuild no such module
no such module 'stripe swift
no such module 'alamofire'
no such module 'cryptoswift'
no such module 'rxswift'
no such module 'cryptokit'
no such module 'facebookcore'

Using CocoaPods, I have imported the below frameworks:

platform :ios, '11.0'
use frameworks!

target '{APP NAME}' do
    pod 'Firebase'
    pod 'Firebase/Auth'
    pod 'Firebase/Core'
    pod 'Firebase/Database'
    pod 'Firebase/AdMob'
    pod 'Firebase/Messaging'
    pod 'Batch'
    pod 'FBSDKLoginKit'
    pod 'FBSDKCoreKit'
    pod 'Google-Mobile-Ads-SDK'
end

When I build my project, it runs happily on my iPhone with no errors.

When I try to create an Archive of the project, it shows one of the below and refuses to build the project to Archive.

No such module 'FBSDKCoreKit'
No such module 'FBSDKLoginKit'

I have no idea what I'm doing wrong as nothing has changed. I haven't archived in a few months and it's suddenly stopped working.

I've removed and re-installed the Pods but nothing seems to fix the issue. Even if I remove one of the import statements the other FBSKD seems to fail.


Try this!

pod 'FBSDKCoreKit', '~> 4.10.0'
pod 'FBSDKLoginKit', '~> 4.10.0'
pod 'FBSDKShareKit', '~> 4.10.0'

How to fix “No such module” Swift? : swift, What i do when adding Pods to my project is first do a Build (Cmd + b) so that they are built, after that the module will be found. If module.modulemap is not present, you will get the “No such module ‘MyFramework'” error. If the Modules folder is missing the “MyFramework.swiftmodule” folder then the framework will be found but Xcode won’t know about its contents so you will get different errors.


Please add

pod 'FBSDKCoreKit'

also.

What's happening that I receive always no such module 'module , What's happening that I receive always no such modules? I run pod install before to open my-Project.xcworkspace as Xcode 8.3 or other Xcode  It looks like you've added the path to RealmSwift.framework to your framework search paths. The Realm Swift installation instructions say to add the parent path of RealmSwift.framework (i.e., the containing directory) to your framework search paths.


Try to update your pod file like this

 pod 'FacebookCore'
 pod 'FacebookLogin'

No such module 'React' · Issue #26256 · facebook/react-native , No such module 'React' in the new project! My old project with react native not run with react native 0.60.5. I create a new iOS project and  I'm not sure what is going. Open a new project, drop SwiftyJSON on project tree. Select Copy. Xcode 6.0.1 Compile and I get "No such Module SwiftyJSON" Attached screen shot.


Not sure if you already found an answer but this worked for me, I had the same problem as you, kind of weird but it worked.

I uninstalled the pods 'FBSDKCoreKit', 'FBSDKShareKit', and 'FBSDKLoginKit'

I then installed pods 'FacebookCore' and 'FacebookLogin' this also installs the previous pods I uninstalled.

When I typed import FBSDKCoreKit in my AppDelegate header I still received an error.

So just for shits and gigs I removed import FBSDKCoreKit and replaced it with import FacebookLogin and there were no errors

I then typed in the necessary code in my AppDelegate file stated in the instructions of Step 5: Connect to AppDelegate (https://developers.facebook.com/docs/ios/getting-started)

I ran the app, the build failed but I went into my AppDelegate file and again, for shits and gigs, typed in import FBSDKCoreKit in the header (without removing import FacebookCore) and there were no errors. Then I removed import FacebookCore from the header and still no errors.

still messing with the syntax to get "Build Successful" but it seems to be heading in the right direction.

I'm new to xCode and Swift, so honestly I'm not exactly sure what I did that was the main reason for the fix but this worked for me. Let me know if this helped!

install with cocoapods, but no such module Quick · Issue #731 , today, I try to use Quick in my project, after pod install, I try to import Quick, but get the error: no such module Quick xCode:8.3.3  No such module: atom_common_app Electron version: 1.4.12 Operating system: Mac OS X, Windows 7/10, Linux How to reproduce Dunno. We started to see the issue in our Sentry 5 days ago.


The actual issue is there is a bug with Xcode wherein its not recognizing the pods already installed and added to the project.Thats why the module not found error during compile time. I am getting the same build error with many other pods afterwards also.Its happening only at times that too unexpectedly .The only way is to build the project multiple times until it recognizes the module and the error is gone .This sounds crazy but no other way so far. Also, Use cmd+B to build your code. Hope this helps.

Xcode Test fails with - error: no such module 'X' import X, Xcode Test step fails with: /Users/vagrant/git/REDACTED/Models/REDACTED.​swift:9:8: error: no such module 'X' import X Testing failed: No  devxoul changed the title RxTest via Swift Package Manager No such module 'RxTest' with Swift Package Manager Apr 23, 2017 kzaher added a commit that referenced this issue Apr 25, 2017


SPM in project pre Xcode 11, The result is always the same, if I import SPM library in any file I get an error "No such module 'ExampleFramework'". Any ideas? Thanks in  Hello, I have also the same problem, but I am new to this and I do not know how to install the simplecluster solution which is at #14. I am very new unfortunately, and it would mean so much to me if someone could give me a dummy-prove step by step guide to 'install' this module ( I have never installed any module before, only recently stumbled into the world of node js and still exploring


No such Module Error on Project:Support desk, LUA: 5.1.5. And i'm getting the error "Script error: No such module." on templates such as this on: http://ftvworld.net/wiki/index.php?title=Template:Pp-​template. Join GitHub today. GitHub is home to over 40 million developers working together to host and review code, manage projects, and build software together.


Just.swift:2:8: error: no such module 'FoundationNetworking , error in 06_cuda notebook. Anybody have experience with this? It fails in importing the Just library. Just.swift:2:8: error: no such module 'Fou… SQLITE3 reader: Database query 'PRAGMA table_info("ElementaryGeometries");' failed. SQLite3 Engine error: 'no such module: VirtualElementary' However, in the Data Inspecter, I can open the data with the same reader. Does anyone have an explanation for this? The SpatiaLite database is filled in QGis, but I do not know how it was created initially.