AAPT2 error: check logs for details after Android Studio upgrade

aapt2 process unexpectedly exit. error output signed apk
om android tools aapt2 aapt2exception aapt2 error check logs for details
aapt2 error: check logs for details failed linking references
error failed to resolve aapt2
error: resource android:attr/fontvariationsettings not found.
com.android.builder.internal.aapt.v2.aapt2exception: android resource linking failed
android enableaapt2 false example
aapt2. exe error

I've upgraded my Android Studio, since this I get an error "AAPT2 error: check logs for details"

In the internet I didn't find a solution.

My androidmanifest:

<?xml version="1.0" encoding="utf-8"?>
<manifest xmlns:android="http://schemas.android.com/apk/res/android"
    android:versionName="1.0" >

         The ACCESS_COARSE/FINE_LOCATION permissions are not required to use
         Google Maps Android API v2, but you must specify either coarse or fine
         location permissions for the 'MyLocation' functionality. 
    <uses-permission android:name="android.permission.ACCESS_FINE_LOCATION" />
    <uses-permission android:name="android.permission.INTERNET" />
    <uses-permission android:name="android.permission.READ_EXTERNAL_STORAGE" />
    <uses-permission android:name="android.permission.WRITE_EXTERNAL_STORAGE" />

        android:value="@string/google_maps_key" />


        <activity android:name=".TrackActivity">
                <action android:name="android.intent.action.MAIN" />
                <category android:name="android.intent.category.LAUNCHER" />
            android:label="@string/title_activity_profile" >


            android:label="@string/title_activity_track_workout" >


            android:label="@string/title_activity_settings" >

            android:label="@string/title_activity_dashboard" >

            android:label="@string/title_activity_create_plan" >

            android:label="@string/title_activity_create_exercise" >

            android:label="@string/title_activity_edit" >

            android:label="@string/title_activity_login" >

            android:label="@string/title_activity_workout_detail" >

            android:label="@string/title_activity_plan_detail" >

        <activity android:name=".CalendarActivity" >

        <activity android:name=".EditExerciseActivity">


I tried a reinstall and downgrad of the android sdk. I deleted .gradle. I set the property android.enableAapt2=false in gradle.properties

What else can I try? What other information do you need?

I ran into this problem a while ago, after updating my Android Studio to the latest version. After searching for a long time, this answer was my savior.

As this answer suggests, the problem might be messed up XML files in your project. You can look for the messed up part by yourself, or run the assembleDebug command in your terminal (like this), which can find the exact line that should be fixed.

AAPT2 error: check logs for details after Android Studio upgrade , I ran into this problem a while ago, after updating my Android Studio to the latest version. After searching for a long time, this answer was my  Android Studio 3.1 has been released on March 2018 with various of new features and also many improvements such as Incremental desugaring, SQL editing improvements with Room, Simplified output window, Improvement for Kotlin support and many more. If you have upgrade to Android Studio 3.1, there’s one feature that changed.

Based on Google's documentation:

If you are experiencing issues while using AAPT2, you can disable it by setting android.enableAapt2=false in your gradle.properties file and restarting the Gradle daemon by running ./gradlew --stop from the command line.

When you set the android.enableAapt2=false you have to restart the Gradle daemon. You should restart the Daemon and then Click on

Also ensure that you are using latest buildToolsVersion

AAPT2 error check logs for details, AAPT2 error check logs for details. Event Log - Android Studio.Duration: 3:50 Posted: Aug 20, 2018 > Error: java.util.concurrent.ExecutionException: com.android.tools.aapt2.Aapt2Exception: AAPT2 error: check logs for details * Try: Run with --stacktrace option to get the stack trace. Run with --info or --debug option to get more log output. * Get more help at https://help.gradle.org. BUILD FAILED in 4s

I also got same problem.By changing build.gradle file like as follows i resolved that. android { compileSdkVersion 27 buildToolsVersion '27.0.3'

defaultConfig {
    minSdkVersion 16
    targetSdkVersion 27
    versionCode 1
    versionName "1.0"

How to Fix Android Studio 3.1 Error Debugging Issue, I've update to Android Studio 3.1 and try my first debug to emulator. And…. WTF! It show Aapt2Exception: AAPT2 error: check logs for details. From here I have  Force your users to update your app with using Firebase Add to Any Android Studio Projects - Duration: 13:54. Event Log - Android Studio 8,273 views

I also solved the issue as per Paila Khagesh suggestion. I had

compileSdkVersion 26 


targetSdkVersion 25

After changing targetSdkVersion to 26 and sync gradle error was gone.

Error:com.android.tools.aapt2.Aapt2Exception: AAPT2 error: check , android.tools.aapt2.Aapt2Exception: AAPT2 error: check logs for details. Error in gradle 3. 1 Answer. When I started the project, the app would sucessfully load without errors, but lately I've been getting these AAPT2 exception errors and failings with manifest processing. The Android Studio version is 3.0.1. I heard that it is possible to fix some errors with AAPT2 by updating the "Android SDK build-tools", the version now is 27.0.1.

Many ways to create this problem! Here is one that we created and had no idea why it happened. By accident we pasted our favorite color.xml file int the styles.xml folder. We had no warning when we did the paste and not while continuing to design the app. BUT when we closed the app and it needed to rebuild when loaded the fun began. We guess the solution might be to build before you close the app or review all your XML files before you build or close better yet LOOK WHERE YOU ARE PASTING

AAPT2 error during Android compilation · Issue #1094 · NativeScript , Aapt2Exception: AAPT2 error: check logs for details. 0 Android Studio 3.0 RC 2 After that, you'll need to fix errors manually anyways. Try to update your gradle plugin to 3.3.0-alpha06 to check if that fixes your issue. Update 1: Non-ascii characters issues have been fixed in AAPT2 and android gradle  Solution :Add this line to your gradle.propreties page : Android.enableAapt2=false How to fix AAPT2 error Android Studio 3.0 Comment réparer l'erreur AAPT2 A

Known issues with Android Studio and Android Gradle Plugin, I get the following error while running tns run android : Aapt2Exception: AAPT2 error: check logs for details FAILURE: Build failed with an exception. problem could be solved by updating Gradle in tns-android to at least  Copy & Paste Videos and Earn $100 to $300 Per Day - FULL TUTORIAL (Make Money Online) - Duration: 22:51. BIG MARK Recommended for you

Android Studio How To Fix: Aapt2 Error: Check Logs For Details , Workaround 1: Run the Gradle check task from the IDE rather than running a unit test. Workaround 2: Update your build script to manually copy resources into the​  APP ID: 1820817 I have been trying to upgrade my CLI version from 6 to 8 and finally got the build working, but when I unlocked the key to test production build it fails. I have no idea why it fails here. I have tried removing the mdpi image and using only single screen resolution. I have recreated

And always when i open my BB File in Android Studio, i get this Error Message: AAPT2 error: check logs for details. Please i need help how to  Android plugin 3.0.0-beta1 dan yang lebih tinggi menyertakan update berikut untuk membantu mengatasi masalah bug dan kinerja pada project Android yang besar:. Paralelisme yang lebih baik untuk project-project multi-modul melalui grafik tugas berjaringan halus.

  • Did you try with AAPT2 true?
  • yes, same error
  • This can occur if your build.gradle references a dependency that doesn't properly declare its own dependencies. If that's the problem, the solution is to manually add the missing transitive dependency.
  • I tried this solution. I found error: resource style/FirebaseUI (aka ch.workouttracker:style/FirebaseUI) not found. So I guess something wirh firebase ui is wrong. I use 'com.firebaseui:firebase-ui:1.2.0' should I use a different versipn?
  • @ChristianBohli Try changing all of your Firebase libraries to 12.0.1.
  • ` 'com.google.firebase:firebase-corpe:12.0.1' 'com.google.firebase:firebase-messaging:12.0.1' 'com.google.firebase:firebase-auth:12.0.1' 'com.google.firebase:firebase-database:12.0.1' 'com.google.firebase:firebase-storage:12.0.1' 'com.firebaseui:firebase-ui-auth:3.3.2''com.jjoe64:graphview:4.2.1' 'org.apache.commons:commons-lang3:3.4' 'com.google.android.gms:play-services-location:12.0.0' 'com.google.android.gms:play-services-auth:12.0.0' 'com.google.android.gms:play-services-maps:12.0.0'` still the same error
  • DO NOT USE THIS! AAPT has been deprecated, and has been replaced by AAPT2. Doing this puts your problems far down the line instead of handling it now.